OH..H anion

Gas phase ion energetics data

Data compiled by: John E. Bartmess

Electron affinity of neutral species

EAneutral (eV) Method Reference Comment
1.20 ± 0.50EIAEGriffiths and Harris, 1987

References

Griffiths and Harris, 1987
Griffiths, W.J.; Harris, F.M., Evidence of Stable H2O-. Ions (lifetime 4 usec) Formed by Charge Inversion Reactions within a Double Focusing Mass Spectrometer, Org. Mass Spectrom., 1987, 22, 8, 559, https://doi.org/10.1002/oms.1210220817 . [all data]