F3PS..F anion

Gas phase thermochemistry data

Data compiled by: John E. Bartmess

Quantity Value Units Method Reference Comment
Δfgas-349. ± 18.kcal/molTherRhyne and Dillard, 1971Fluoride Affinity: between SF4, SF5. Original value 32±10, now altered with new aff.

References

Rhyne and Dillard, 1971
Rhyne, T.C.; Dillard, J.G., Reactions of gaseous inorganic negative ions: III. SF6- with POF3 and PSF3, Int. J. Mass Spectrom. Ion Phys., 1971, 7, 371. [all data]