CHCl3..Cl anion

Gas phase thermochemistry data

Data compiled by: John E. Bartmess

Quantity Value Units Method Reference Comment
Δfgas-393.6kJ/molTherYamdagni and Kebarle, 1971

Reaction thermochemistry data

Data compiled by: John E. Bartmess

Individual Reactions

CHCl4- + 2Trichloromethane = C2H2Cl7-

By formula: CHCl4- + 2CHCl3 = C2H2Cl7-

Quantity Value Units Method Reference Comment
Δr61.50kJ/molN/AHiraoka, Mizuno, et al., 2001gas phase
Quantity Value Units Method Reference Comment
Δr30.3kJ/molTDAsHiraoka, Mizuno, et al., 2001gas phase

Ion clustering data

Data compiled by: John E. Bartmess

Clustering reactions

CHCl4- + 2Trichloromethane = C2H2Cl7-

By formula: CHCl4- + 2CHCl3 = C2H2Cl7-

Quantity Value Units Method Reference Comment
Δr61.50kJ/molN/AHiraoka, Mizuno, et al., 2001gas phase
Quantity Value Units Method Reference Comment
Δr30.3kJ/molTDAsHiraoka, Mizuno, et al., 2001gas phase

References

Yamdagni and Kebarle, 1971
Yamdagni, R.; Kebarle, P., Hydrogen bonding energies to negative ions from gas phase measurements of ionic equilibria, J. Am. Chem. Soc., 1971, 93, 7139. [all data]

Hiraoka, Mizuno, et al., 2001
Hiraoka, K.; Mizuno, T.; Iino, T.; Eguchi, D.; Yamabe, S., Characteristic changes of bond energies for gas-phase cluster ions of halide ions with methane and chloromethanes, J. Phys. Chem. A, 2001, 105, 20, 4887-4893, https://doi.org/10.1021/jp010143n . [all data]