iPr3B..F anion

Gas phase thermochemistry data

Data compiled by: John E. Bartmess

Quantity Value Units Method Reference Comment
Δfgas-184.72kcal/molTherMurphy and Beauchamp, 1977Fluoride Affinity: iPr2BF > iPr3B > Et2BF > Et3B

References

Murphy and Beauchamp, 1977
Murphy, M.K.; Beauchamp, J.L., Fluorine and Alkyl Substituent Effects on Gas-Phase Lewis Acidities of Boranes by ICR Spectroscopy, Inorg. Chem., 1977, 16, 2437. [all data]