cyclohexenide anion

Gas phase ion energetics data

Data compiled by: John E. Bartmess

Protonation reactions

C6H9- + Hydrogen cation = Cyclohexene

By formula: C6H9- + H+ = C6H10

Quantity Value Units Method Reference Comment
Δr386.5 ± 5.1kcal/molG+TSLee and Squires, 1986gas phase; Between H2O, MeOH
Quantity Value Units Method Reference Comment
Δr379.0 ± 5.0kcal/molIMRBLee and Squires, 1986gas phase; Between H2O, MeOH

References

Lee and Squires, 1986
Lee, R.E.; Squires, R.R., Anionic homoaromaticity: A gas phase experimental study, J. Am. Chem. Soc., 1986, 105, 5078. [all data]