bicyclo[3.2.1]oct-2-en-4-ide anion

Reaction thermochemistry data

Data compiled by: John E. Bartmess

Individual Reactions

C8H11- + Hydrogen cation = Bicyclo(3.2.1)oct-2-ene

By formula: C8H11- + H+ = C8H12

Quantity Value Units Method Reference Comment
Δr1634.4 ± 3.6kJ/molG+TSLee and Squires, 1986gas phase
Quantity Value Units Method Reference Comment
Δr1603.7 ± 2.5kJ/molIMRELee and Squires, 1986gas phase

Gas phase ion energetics data

Data compiled by: John E. Bartmess

Protonation reactions

C8H11- + Hydrogen cation = Bicyclo(3.2.1)oct-2-ene

By formula: C8H11- + H+ = C8H12

Quantity Value Units Method Reference Comment
Δr1634.4 ± 3.6kJ/molG+TSLee and Squires, 1986gas phase
Quantity Value Units Method Reference Comment
Δr1603.7 ± 2.5kJ/molIMRELee and Squires, 1986gas phase

References

Lee and Squires, 1986
Lee, R.E.; Squires, R.R., Anionic homoaromaticity: A gas phase experimental study, J. Am. Chem. Soc., 1986, 105, 5078. [all data]