MeCO anion

Reaction thermochemistry data

Data compiled by: John E. Bartmess

Individual Reactions

C2H3O- + Hydrogen cation = Acetaldehyde

By formula: C2H3O- + H+ = C2H4O

Quantity Value Units Method Reference Comment
Δr1645.1 ± 4.0kJ/molD-EANimlos, Soderquist, et al., 1989gas phase
Δr1636. ± 8.8kJ/molG+TSDePuy, Bierbaum, et al., 1985gas phase
Δr1619. ± 33.kJ/molCIDTGraul and Squires, 1990gas phase
Δr<1598.3kJ/molCIDTGraul and Squires, 1988gas phase
Quantity Value Units Method Reference Comment
Δr1613. ± 4.6kJ/molH-TSNimlos, Soderquist, et al., 1989gas phase
Δr1604. ± 8.4kJ/molIMRBDePuy, Bierbaum, et al., 1985gas phase
Δr<1565.9 ± 2.5kJ/molH-TSGraul and Squires, 1988gas phase

References

Nimlos, Soderquist, et al., 1989
Nimlos, M.R.; Soderquist, J.A.; Ellison, G.B., Spectroscopy of CH3CO- and CH3CO, J. Am. Chem. Soc., 1989, 111, 20, 7675, https://doi.org/10.1021/ja00202a001 . [all data]

DePuy, Bierbaum, et al., 1985
DePuy, C.H.; Bierbaum, V.M.; Damrauer, R.; Soderquist, J.A., Gas-phase reactions of the acetyl anion, J. Am. Chem. Soc., 1985, 107, 3385. [all data]

Graul and Squires, 1990
Graul, S.T.; Squires, R.R., Gas-Phase Acidities Derived from Threshold Energies for Activated Reactions, J. Am. Chem. Soc., 1990, 112, 7, 2517, https://doi.org/10.1021/ja00163a007 . [all data]

Graul and Squires, 1988
Graul, S.T.; Squires, R.R., On the Existence of Alkyl Carbanions in the Gas Phase, J. Am. Chem. Soc., 1988, 110, 2, 607, https://doi.org/10.1021/ja00210a054 . [all data]