Et3SiH..H anion

Gas phase thermochemistry data

Data compiled by: John E. Bartmess

Quantity Value Units Method Reference Comment
Δfgas-114.2kJ/molTherHajdasz, Ho, et al., 1994affinity order: Et3SiH≤Et2SiH2≤nPnSiH3≤SiH4. nPnSiH3 is 0.4±0.2 kcal/mol > Et3SiH in ΔG. Et3SiH dHf(77PR) is wrong.

References

Hajdasz, Ho, et al., 1994
Hajdasz, D.J.; Ho, Y.; Squires, R.R., Gas-Phase Chemistry of Pentacoordinate Silicon Hydrides, J. Am. Chem. Soc., 1994, 116, 23, 10751, https://doi.org/10.1021/ja00102a045 . [all data]