BrO anion

Reaction thermochemistry data

Data compiled by: John E. Bartmess

Individual Reactions

BrO- + Hydrogen cation = Hypobromous acid

By formula: BrO- + H+ = HBrO

Quantity Value Units Method Reference Comment
Δr355. ± 66.kcal/molAcidGilles, Polak, et al., 1992gas phase
Quantity Value Units Method Reference Comment
Δr349. ± 67.kcal/molH-TSGilles, Polak, et al., 1992gas phase

Gas phase ion energetics data

Data compiled by: John E. Bartmess

Protonation reactions

BrO- + Hydrogen cation = Hypobromous acid

By formula: BrO- + H+ = HBrO

Quantity Value Units Method Reference Comment
Δr355. ± 66.kcal/molAcidGilles, Polak, et al., 1992gas phase
Quantity Value Units Method Reference Comment
Δr349. ± 67.kcal/molH-TSGilles, Polak, et al., 1992gas phase

References

Gilles, Polak, et al., 1992
Gilles, M.K.; Polak, M.L.; Lineberger, W.C., Photoelectron Spectroscopy of the Halogen Oxide Anions FO-, ClO-, BrO-, IO-, OClO-, and OIO-, J. Chem. Phys., 1992, 96, 11, 8012, https://doi.org/10.1063/1.462352 . [all data]