P3 anion

Gas phase thermochemistry data

Data compiled by: John E. Bartmess

Quantity Value Units Method Reference Comment
Δfgas49. ± 21.kJ/molR-EAJones, Ganteför, et al., 1995Vertical Detachment Energy: 1.68±0.05 eV
Δfgas160. ± 19.kJ/molEIAEBennett, Margrave, et al., 1974From P4

References

Jones, Ganteför, et al., 1995
Jones, R.O.; Ganteför, G.; Hunsicker, S.; Pieperhoff, P., Structure and Spectroscopy of Phosphorous Cluster anions: Theory (simulated annealing) and Experiment (Photoelectron Detachment), J. Chem. Phys., 1995, 103, 22, 9549, https://doi.org/10.1063/1.469969 . [all data]

Bennett, Margrave, et al., 1974
Bennett, S.L.; Margrave, J.L.; Franklin, J.L., High temperature negative ions. Electron impact study of tetratomic phosphorous vapor, J. Chem. Phys., 1974, 61, 1647. [all data]