ICH2 anion

Gas phase ion energetics data

Data compiled by: John E. Bartmess

Protonation reactions

CH2I- + Hydrogen cation = Methane, iodo-

By formula: CH2I- + H+ = CH3I

Quantity Value Units Method Reference Comment
Δr1616. ± 21.kJ/molG+TSIngemann and Nibbering, 1985gas phase
Quantity Value Units Method Reference Comment
Δr1587. ± 20.kJ/molIMRBIngemann and Nibbering, 1985gas phase

Reaction thermochemistry data

Data compiled by: John E. Bartmess

Individual Reactions

CH2I- + Hydrogen cation = Methane, iodo-

By formula: CH2I- + H+ = CH3I

Quantity Value Units Method Reference Comment
Δr1616. ± 21.kJ/molG+TSIngemann and Nibbering, 1985gas phase
Quantity Value Units Method Reference Comment
Δr1587. ± 20.kJ/molIMRBIngemann and Nibbering, 1985gas phase

References

Ingemann and Nibbering, 1985
Ingemann, S.; Nibbering, N.M.M., Gas-phase acidity of CH3X [X = P(CH3)2, SCH3, F, Cl, Br, I] compounds, J. Chem. Soc. Perkin Trans. 2, 1985, 837. [all data]