BrCH2 anion

Reaction thermochemistry data

Data compiled by: John E. Bartmess

Individual Reactions

CH2Br- + Hydrogen cation = Methane, bromo-

By formula: CH2Br- + H+ = CH3Br

Quantity Value Units Method Reference Comment
Δr396.7 ± 2.5kcal/molEndoHierl, Henchman, et al., 1992gas phase; HO- + MeBr:6.0±2.3 kcal/mol endo. "Better than Ingemann and Nibbering, 19852" 2.0 kcal would not show barrier
Δr394.3 ± 4.6kcal/molEIAERogers, Simpson, et al., 2010gas phase
Δr392.7 ± 3.1kcal/molG+TSIngemann and Nibbering, 1985, 2gas phase
Quantity Value Units Method Reference Comment
Δr389.7 ± 3.4kcal/molH-TSHierl, Henchman, et al., 1992gas phase; HO- + MeBr:6.0±2.3 kcal/mol endo. "Better than Ingemann and Nibbering, 19852" 2.0 kcal would not show barrier
Δr385.8 ± 3.0kcal/molIMRBIngemann and Nibbering, 1985, 2gas phase

References

Hierl, Henchman, et al., 1992
Hierl, P.M.; Henchman, M.J.; Paulson, J.F., Threshold Energies for the Reactions HO- + MeX - MeOH + X- measured by Tandem Mass Spectrometry: Acidities of MeCl and MeBr, Int. J. Mass Spectrom. Ion Proc., 1992, 117, 475, https://doi.org/10.1016/0168-1176(92)80109-E . [all data]

Ingemann and Nibbering, 1985
Ingemann, S.; Nibbering, N.M.M., Gas phase chemistry of alpha-thio carbanions, Can. J. Chem., 1985, 62, 2273. [all data]

Rogers, Simpson, et al., 2010
Rogers, N.J.; Simpson, M.J.; Tuckett, R.P.; Dunn, K.F.; Latimer, C.J., Vacuum-UV negative photoion spectroscopy of CH3F, CH3Cl and CH3Br, Phys. Chem. Chem. Phys., 2010, 12, 36, 10971-10980, https://doi.org/10.1039/c0cp00234h . [all data]

Ingemann and Nibbering, 1985, 2
Ingemann, S.; Nibbering, N.M.M., Gas-phase acidity of CH3X [X = P(CH3)2, SCH3, F, Cl, Br, I] compounds, J. Chem. Soc. Perkin Trans. 2, 1985, 837. [all data]