Selenium oxide anion

Gas phase thermochemistry data

Data compiled by: John E. Bartmess

Quantity Value Units Method Reference Comment
Δfgas-132. ± 21.kJ/molR-EACoe, Snodgrass, et al., 1986

References

Coe, Snodgrass, et al., 1986
Coe, J.V.; Snodgrass, J.T.; Freidhoff, C.B.; McHugh, K.M.; Bowen, K.H., Photoelectron spectroscopy of the negative ion SeO-, J. Chem. Phys., 1986, 84, 618. [all data]