TeO radical anion

Gas phase thermochemistry data

Data compiled by: John E. Bartmess

Quantity Value Units Method Reference Comment
Δfgas-95. ± 21.kJ/molR-EAFreidhoff, Coe, et al., 1986

References

Freidhoff, Coe, et al., 1986
Freidhoff, C.B.; Coe, J.V.; Snodgrass, J.T.; McHugh, K.M.; Bowen, K.H., Negative ion photoelectron spectroscopy of TeO-, Chem. Phys. Lett., 1986, 124, 268. [all data]