CoH anion

Gas phase thermochemistry data

Data compiled by: John E. Bartmess

Quantity Value Units Method Reference Comment
Δfgas412. ± 13.kJ/molR-EAMiller, Feigerle, et al., 1987

References

Miller, Feigerle, et al., 1987
Miller, A.E.S.; Feigerle, C.S.; Lineberger, W.C., Laser photoelectron spectroscopy of CrH-, CoH-, and NiH-: Periodic trends in the electronic structure of the transition-metal hydrides, J. Chem. Phys., 1987, 86, 1549. [all data]