Co2 anion

Gas phase thermochemistry data

Data compiled by: John E. Bartmess

Quantity Value Units Method Reference Comment
Δfgas575.7 ± 8.4kJ/molR-EALeopold and Lineberger, 1986

References

Leopold and Lineberger, 1986
Leopold, D.G.; Lineberger, W.C., A study of the low-lying electronic states of Fe2 and Co2 by negative ion photoelectron spectroscopy, J. Chem. Phys., 1986, 85, 51. [all data]