3,4,5-triCl-phenoxide anion

Gas phase ion energetics data

Data compiled by: John E. Bartmess

Electron affinity of neutral species

EAneutral (eV) Method Reference Comment
3.24 ± 0.14D-EAFujio, McIver, et al., 1981value altered from reference due to change in acidity scale

Protonation reactions

C6H2Cl3O- + Hydrogen cation = Phenol, 3,4,5-trichloro-

By formula: C6H2Cl3O- + H+ = C6H3Cl3O

Quantity Value Units Method Reference Comment
Δr330.7 ± 2.2kcal/molG+TSFujio, McIver, et al., 1981gas phase; value altered from reference due to change in acidity scale
Quantity Value Units Method Reference Comment
Δr323.9 ± 2.0kcal/molIMREFujio, McIver, et al., 1981gas phase; value altered from reference due to change in acidity scale

References

Fujio, McIver, et al., 1981
Fujio, M.; McIver, R.T., Jr.; Taft, R.W., Effects on the acidities of phenols from specific substituent-solvent interactions. Inherent substituent parameters from gas phase acidities, J. Am. Chem. Soc., 1981, 103, 4017. [all data]