SiF4..F anion

Gas phase thermochemistry data

Data compiled by: John E. Bartmess

Quantity Value Units Method Reference Comment
Δfgas<-1988. ± 4.2kJ/molR-EAKawamata, Neigishi, et al., 1996
Δfgas-2148. ± 21.kJ/molTherMurphy and Beauchamp, 1977Fluoride Affinity: <BF3, >iPr2BF
Δfgas<-2317.9kJ/molIMRBMacNeil and Thynne, 1970

References

Kawamata, Neigishi, et al., 1996
Kawamata, H.; Neigishi, Y.; Kishi, R.; Iwata, S.; Nakajima, A.; Kaya, K., Photoelectron Spectroscopy of Silicon-Fluorine Binary Cluster Anions (SinFm-), J. Chem. Phys., 1996, 105, 13, 5369, https://doi.org/10.1063/1.472377 . [all data]

Murphy and Beauchamp, 1977
Murphy, M.K.; Beauchamp, J.L., Methyl and Fluorine Substituent Effects on the Gas Phase Lewis Acidities of Silanes by ICR Spectroscopy, J. Am. Chem. Soc., 1977, 99, 15, 4992, https://doi.org/10.1021/ja00457a017 . [all data]

MacNeil and Thynne, 1970
MacNeil, K.A.G.; Thynne, J.C.J., The Formation of Negative Ions by Electron Impact on Silicon Tetrafluoride and Carbon Tetrafluoride, Int. J. Mass Spectrom. Ion Phys., 1970, 3, 6, 455, https://doi.org/10.1016/0020-7381(70)80004-3 . [all data]