UCH

Vibrational and/or electronic energy levels

Data compiled by: Marilyn E. Jacox

State:   X

Vib.
sym.
 No.   Approximate
 type of mode
 cm-1   Med.   Method   References

2 Bend 545.0 Ar IR Wang, Andrews, et al., 2011
3 UC stretch 798.6 Ar IR Wang, Andrews, et al., 2011

References

Wang, Andrews, et al., 2011
Wang, X.; Andrews, L.; Ma, D.; Gagliardi, L.; Goncalves, A.P.; Pereira, C.C.L.; Marcalo, J.; Godart, C.; Villeroy, B., Infrared spectra and quantum chemical calculations of the uranium-carbon molecules UC, CUC, UCH, and U(CC)2, J. Chem. Phys., 2011, 134, 24, 244313, https://doi.org/10.1063/1.3602325 . [all data]