O(cyc-ZrSO)

Vibrational and/or electronic energy levels

Data compiled by: Marilyn E. Jacox

State:   X

Vib.
sym.
 No.   Approximate
 type of mode
 cm-1   Med.   Method   References

a 1 Zr=O stretch 905.3 Ne IR Liu, Wang, et al., 2012
1 Zr=O stretch 889.1 Ar IR Liu, Wang, et al., 2012
2 S-O stretch 696.8 Ne IR Liu, Wang, et al., 2012
2 S-O stretch 702.7 Ar IR Liu, Wang, et al., 2012
3 SZrO deform. 557.3 Ne IR Liu, Wang, et al., 2012
3 SZrO deform. 553.2 Ar IR Liu, Wang, et al., 2012

References

Liu, Wang, et al., 2012
Liu, X.; Wang, X.; Wang, Q.; Andrews, L., OMS, OM(η, Inorg. Chem., 2012, 51, 13, 7415, https://doi.org/10.1021/ic3008987 . [all data]