O(cyc-TiSO)

Vibrational and/or electronic energy levels

Data compiled by: Marilyn E. Jacox

State:   X

Vib.
sym.
 No.   Approximate
 type of mode
 cm-1   Med.   Method   References

a 1 Ti=O stretch 987.4 Ne IR Liu, Wang, et al., 2012
1 Ti=O stretch 970.9 Ar IR Liu, Wang, et al., 2012
2 S-O stretch 749.2 Ne IR Liu, Wang, et al., 2012
2 S-O stretch 747.3 Ar IR Liu, Wang, et al., 2012

References

Liu, Wang, et al., 2012
Liu, X.; Wang, X.; Wang, Q.; Andrews, L., OMS, OM(η, Inorg. Chem., 2012, 51, 13, 7415, https://doi.org/10.1021/ic3008987 . [all data]