HgF4

Vibrational and/or electronic energy levels

Data compiled by: Marilyn E. Jacox

State:   X

Vib.
sym.
 No.   Approximate
 type of mode
 cm-1   Med.   Method   References

eu HgF 703 Ne IR Wang, Andrews, et al., 2007
HgF 682 Ar IR Wang, Andrews, et al., 2007

References

Wang, Andrews, et al., 2007
Wang, X.; Andrews, L.; Riedel, S.; Kaupp, M., Mercury Is a Transition Metal: The First Experimental Evidence for HgF4, Angew. Chem. Int. Ed., 2007, 46, 44, 8371, https://doi.org/10.1002/anie.200703710 . [all data]