F2PNO

Vibrational and/or electronic energy levels

Data compiled by: Marilyn E. Jacox

State:   X

Vib.
sym.
 No.   Approximate
 type of mode
 cm-1   Med.   Method   References

a' 1 NO stretch 1515.0 w m Ar IR Zeng, Beckers, et al., 2009
2 PF2 s-stretch 860.0 m Ar IR Zeng, Beckers, et al., 2009
4 PF2 scissor 396.9 w Ar IR Zeng, Beckers, et al., 2009
a 7 PF2 a-stretch 844.8 m Ar IR Zeng, Beckers, et al., 2009

References

Zeng, Beckers, et al., 2009
Zeng, X.; Beckers, H.; Willner, H.; Neuhaus, P.; Grote, D.; Sander, W., Chem. Eur. J., 2009, 15, 13466. [all data]