DXeOXeD

Vibrational and/or electronic energy levels

Data compiled by: Marilyn E. Jacox

State:   X

Vib.
sym.
 No.   Approximate
 type of mode
 cm-1   Med.   Method   References

b2 XeD a-stretch 1003.3 Xe IR Khriachtchev, Isokoski, et al., 2008

References

Khriachtchev, Isokoski, et al., 2008
Khriachtchev, L.; Isokoski, K.; Cohen, A.; Rasanen, M.; Gerber, R.B., A Small Neutral Molecule with Two Noble-Gas Atoms: HXeOXeH, J. Am. Chem. Soc., 2008, 130, 19, 6114, https://doi.org/10.1021/ja077835v . [all data]