DODOD-

Vibrational and/or electronic energy levels

Data compiled by: Marilyn E. Jacox

State:   X

Vib.
sym.
 No.   Approximate
 type of mode
 cm-1   Med.   Method   References

ODO a-stretch 473 T Ne IR Jacox and Thompson

References

Jacox and Thompson
Jacox, M.E.; Thompson, W.E., J. Phys. Chem. A 117. [all data]