D2O(DO)

Vibrational and/or electronic energy levels

Data compiled by: Marilyn E. Jacox

State:   X

Vib.
sym.
 No.   Approximate
 type of mode
 cm-1   Med.   Method   References

D2O a-stretch 2775.8 Ar IR Engdahl, Karlstrom, et al., 2003
D2O a-stretch 2771.5 Ar IR Engdahl, Karlstrom, et al., 2003
D2O a-stretch 2763.3 Ar IR Engdahl, Karlstrom, et al., 2003
D2O a-stretch 2758.7 Ar IR Engdahl, Karlstrom, et al., 2003
D2O s-stretch 2655.6 Ar IR Engdahl, Karlstrom, et al., 2003
O..DO a-stretch 2557.5 vs Ne IR Jacox and Thompson
O..DO a-stretch 2543.6 Ar IR Cheng, Lee, et al., 1988
Engdahl, Karlstrom, et al., 2003
D2O scissor 1181.1 Ne IR Jacox and Thompson
D2O scissor 1177.5 Ar IR Engdahl, Karlstrom, et al., 2003

References

Engdahl, Karlstrom, et al., 2003
Engdahl, A.; Karlstrom, G.; Nelander, B., The water--hydroxyl radical complex: A matrix isolation study, J. Chem. Phys., 2003, 118, 17, 7797, https://doi.org/10.1063/1.1563608 . [all data]

Jacox and Thompson
Jacox, M.E.; Thompson, W.E., J. Phys. Chem. A 117. [all data]

Cheng, Lee, et al., 1988
Cheng, B.-M.; Lee, Y.-P.; Ogilvie, J.F., The infrared absorption spectrum of hydroxyl radicals in solid argon, Chem. Phys. Lett., 1988, 151, 1-2, 109, https://doi.org/10.1016/0009-2614(88)80079-4 . [all data]