ClXeNC

Vibrational and/or electronic energy levels

Data compiled by: Marilyn E. Jacox

State:   X

Vib.
sym.
 No.   Approximate
 type of mode
 cm-1   Med.   Method   References

a' 1 NC stretch 2030 Xe IR Arppe, Khriachtchev, et al., 2012
2 Asym. stretch 343 Xe IR Arppe, Khriachtchev, et al., 2012

References

Arppe, Khriachtchev, et al., 2012
Arppe, T.; Khriachtchev, L.; Lignell, A.; Domanskaya, A.V.; Rasanen, M., Halogenated Xenon Cyanides ClXeCN, ClXeNC, and BrXeCN, Inorg. Chem., 2012, 51, 7, 4398, https://doi.org/10.1021/ic3002543 . [all data]