HCCl2-

Vibrational and/or electronic energy levels

Data compiled by: Marilyn E. Jacox

State:   ?

 Energy
 (cm-1
 Med.   Transition   λmin
 (nm)
 λmax
 (nm)

References

Td = 11860 ± 320 gas Born, Ingemann, et al., 2000

State:   ?

 Energy
 (cm-1
 Med.   Transition   λmin
 (nm)
 λmax
 (nm)

Tdx = 21635 gas Vogelhuber, Wren, et al., 2011

Born, Ingemann, et al., 2000
Born, M.; Ingemann, S.; Nibbering, N.M.M., Thermochemical properties of halogen-substituted methanes, methyl radicals, and carbenes in the gas phase, Int. J. Mass Spectrom., 2000, 194, 2-3, 103, https://doi.org/10.1016/S1387-3806(99)00125-6 . [all data]

Vogelhuber, Wren, et al., 2011
Vogelhuber, K.M.; Wren, S.W.; McCoy, A.B.; Ervin, K.M.; Lineberger, W.C., Photoelectron spectra of dihalomethyl anions: Testing the limits of normal mode analysis, J. Chem. Phys., 2011, 134, 18, 184306, https://doi.org/10.1063/1.3585606 . [all data]