cis-CD3CDCDO

Vibrational and/or electronic energy levels

Data compiled by: Marilyn E. Jacox

State:   A

 Energy
 (cm-1
 Med.   Transition   λmin
 (nm)
 λmax
 (nm)

References

To = 9383 ± 24 gas Yacovitch, Kim, et al., 2011

Vib.
sym.
 No.   Approximate
 type of mode
 cm-1   Med.   Method   References

a' 5 1579 gas PE Yacovitch, Kim, et al., 2011
6 1199 gas PE Yacovitch, Kim, et al., 2011
10 879 gas PE Yacovitch, Kim, et al., 2011
11 795 gas PE Yacovitch, Kim, et al., 2011
13 528 gas PE Yacovitch, Kim, et al., 2011

State:   X

Vib.
sym.
 No.   Approximate
 type of mode
 cm-1   Med.   Method   References

5 1539 gas PE Yacovitch, Kim, et al., 2011
6 1334 gas PE Yacovitch, Kim, et al., 2011
9 CD rock 1063 gas PE Yacovitch, Kim, et al., 2011
13 599 gas PE Yacovitch, Kim, et al., 2011
114 246 gas PE Yacovitch, Kim, et al., 2011
a 19 CD wag 466 gas PE Yacovitch, Kim, et al., 2011

Yacovitch, Kim, et al., 2011
Yacovitch, T.I.; Kim, J.B.; Garand, E.; van der Poll, D.G.; Neumark, D.M., Slow photoelectron velocity-map imaging spectroscopy of the n-methylvinoxide anion, J. Chem. Phys., 2011, 134, 13, 134307, https://doi.org/10.1063/1.3572269 . [all data]