c-DOCO-

Vibrational and/or electronic energy levels

Data compiled by: Marilyn E. Jacox

State:   ?

 Energy
 (cm-1
 Med.   Transition   λmin
 (nm)
 λmax
 (nm)

References

Td = 12180 ± 80 gas Johnson, Poad, et al., 2011

Johnson, Poad, et al., 2011
Johnson, C.J.; Poad, M.E. Harding.B.L.J.; Stanton, J.F.; Continetti, R.E., Electron Affinities, Well Depths, and Vibrational Spectroscopy of, J. Am. Chem. Soc., 2011, 133, 49, 19606, https://doi.org/10.1021/ja207724f . [all data]