ISO2

Vibrational and/or electronic energy levels

Data compiled by: Marilyn E. Jacox

State:   X

Vib.
sym.
 No.   Approximate
 type of mode
 cm-1   Med.   Method   References

SO2 a-stretch 1353.1 T p-H2 IR Lee and Lee, 2011
SO2 s-stretch 1150.1 T p-H2 IR Lee and Lee, 2011

References

Lee and Lee, 2011
Lee, Y.-F.; Lee, Y.-P., Infrared absorption of CH3SO2 observed upon irradiation of a p-H2 matrix containing CH3I and SO2, J. Chem. Phys., 2011, 1334, 12, 124314, https://doi.org/10.1063/1.3567117 . [all data]