HCO3

Vibrational and/or electronic energy levels

Data compiled by: Marilyn E. Jacox

State:   X

Vib.
sym.
 No.   Approximate
 type of mode
 cm-1   Med.   Method   References

a' 6 Deformation 530 ± 20 gas PE Wang and Xantheas, 2011

References

Wang and Xantheas, 2011
Wang, X.-B.; Xantheas, S.S., Photodetachment of Isolated Bicarbonate Anion: Electron Binding Energy of HCO, J. Phys. Chem. Lett., 2011, 2, 10, 1204, https://doi.org/10.1021/jz200327f . [all data]