CH3COO-

Vibrational and/or electronic energy levels

Data compiled by: Marilyn E. Jacox

State:   ?

 Energy
 (cm-1
 Med.   Transition   λmin
 (nm)
 λmax
 (nm)

References

Td = 26220 ± 80 gas Wang, Woo, et al., 2006

Wang, Woo, et al., 2006
Wang, X.-B.; Woo, H.-K.; Wang, L.-S.; Minofar, B.; Jungwirth, P., Determination of the Electron Affinity of the Acetyloxyl Radical (CH, J. Phys. Chem. A, 2006, 110, 15, 5047, https://doi.org/10.1021/jp060138p . [all data]