CD3OCD2

Vibrational and/or electronic energy levels

Data compiled by: Marilyn E. Jacox

State:   X

Vib.
sym.
 No.   Approximate
 type of mode
 cm-1   Med.   Method   References

OCO a-stretch 1267.7 Ar IR Gong and Andrews, 2011
Mixed 1123.0 Ar IR Gong and Andrews, 2011
OCO s-stretch 1033.3 Ar IR Gong and Andrews, 2011

References

Gong and Andrews, 2011
Gong, Y.; Andrews, L., Infrared Spectrum of the CH, J. Phys. Chem. A, 2011, 1115, 14, 3029, https://doi.org/10.1021/jp2018692 . [all data]