(N3)3PO

Vibrational and/or electronic energy levels

Data compiled by: Marilyn E. Jacox

State:   X

Vib.
sym.
 No.   Approximate
 type of mode
 cm-1   Med.   Method   References

a 1 N3 a-stretch 2193 m s gas IR Zeng, Bernhardt, et al., 2011
1 N3 a-stretch 2190.0 m Ar IR Zeng, Bernhardt, et al., 2011
2 PO stretch 1316 m gas IR Zeng, Bernhardt, et al., 2011
2 PO stretch 1311.5 w Ar IR Zeng, Bernhardt, et al., 2011
4 PN3 s-stretch 748.3 w Ar IR Zeng, Bernhardt, et al., 2011
5 N3 deform. 598.0 w Ar IR Zeng, Bernhardt, et al., 2011
e 10 N3 a-stretch 2169 vs gas IR Zeng, Bernhardt, et al., 2011
10 N3 a-stretch 2172.4 vs Ar IR Zeng, Bernhardt, et al., 2011
11 N3 s-stretch 1254 s gas IR Zeng, Bernhardt, et al., 2011
11 N3 s-stretch 1258.7 vs Ar IR Zeng, Bernhardt, et al., 2011
12 PN3 a-stretch 792 s gas IR Zeng, Bernhardt, et al., 2011
12 PN3 a-stretch 781.2 s Ar IR Zeng, Bernhardt, et al., 2011
13 N3 deform. 618 w b gas IR Zeng, Bernhardt, et al., 2011
13 N3 deform. 630.6 m Ar IR Zeng, Bernhardt, et al., 2011
15 OPN deform. 417 w gas IR Zeng, Bernhardt, et al., 2011

References

Zeng, Bernhardt, et al., 2011
Zeng, X.; Bernhardt, E.; Beckers, H.; Willner, H., Synthesis and Characterization of the Phosphorus Triazides OP(N, Inorg. Chem., 2011, 50, 21, 11235, https://doi.org/10.1021/ic201802x . [all data]