(F2)GaF2

Vibrational and/or electronic energy levels

Data compiled by: Marilyn E. Jacox

State:   X

Vib.
sym.
 No.   Approximate
 type of mode
 cm-1   Med.   Method   References

GaF stretch 769.0 Ne IR Wang and Andrews, 2011
GaF stretch 759.1 Ar IR Wang and Andrews, 2011
GaF stretch 710.2 Ne IR Wang and Andrews, 2011
GaF stretch 700.2 Ar IR Wang and Andrews, 2011

References

Wang and Andrews, 2011
Wang, X.; Andrews, L., Quantum-Chemical Calculations and IR Spectra of the (F, J. Am. Chem. Soc., 2011, 133, 11, 3768, https://doi.org/10.1021/ja1110442 . [all data]