D2CF+

Vibrational and/or electronic energy levels

Data compiled by: Marilyn E. Jacox

State:   X

Vib.
sym.
 No.   Approximate
 type of mode
 cm-1   Med.   Method   References

a1 2 CF stretch 1530 ± 30 gas PE Andrews, Dyke, et al., 1984

References

Andrews, Dyke, et al., 1984
Andrews, L.; Dyke, J.M.; Jonathan, N.; Keddar, N.; Morris, A.; Ridha, A., A photoelectron spectroscopic study of the ground states of CH2F+ and CD2F+, J. Phys. Chem., 1984, 88, 2364. [all data]