ClSC

Vibrational and/or electronic energy levels

Data compiled by: Marilyn E. Jacox

State:   X

Vib.
sym.
 No.   Approximate
 type of mode
 cm-1   Med.   Method   References

a' 1 CS stretch 1137.0 p-H2 IR Huang, Lee, et al., 2010

References

Huang, Lee, et al., 2010
Huang, C.-W.; Lee, Y.-C.; Lee, Y.-P., Diminished cage effect in solid p-H[sub 2]: Infrared spectra of ClSCS, ClCS, and ClSC in an irradiated p-H[sub 2] matrix containing Cl[sub 2] and CS[sub 2], J. Chem. Phys., 2010, 132, 16, 164303, https://doi.org/10.1063/1.3386578 . [all data]