CaCCD

Vibrational and/or electronic energy levels

Data compiled by: Marilyn E. Jacox

State:   B

 Energy
 (cm-1
 Med.   Transition   λmin
 (nm)
 λmax
 (nm)

References

To = 16593.6 T gas Faridian, Tokaryk, et al., 2010

State:   A

 Energy
 (cm-1
 Med.   Transition   λmin
 (nm)
 λmax
 (nm)

To = 15523.75 gas Faridian, Tokaryk, et al., 2010

Faridian, Tokaryk, et al., 2010
Faridian, A.; Tokaryk, D.W.; Adam, A.G., Laser spectroscopy of the and transitions of CaCCD, J. Mol. Spectrosc., 2010, 264, 2, 125, https://doi.org/10.1016/j.jms.2010.10.001 . [all data]