cyc-HC3Cl+

Vibrational and/or electronic energy levels

Data compiled by: Marilyn E. Jacox

State:   X

Vib.
sym.
 No.   Approximate
 type of mode
 cm-1   Med.   Method   References

C=C stretch 1160 gas TPE Hemberger, Noller, et al., 2010

References

Hemberger, Noller, et al., 2010
Hemberger, P.; Noller, B.; Steinbauer, M.; Fischer, I.; Alcaraz, C.; Cunha de Miranda, B.K.; Garcia, G.A.; Soldi-Lose, H., Threshold Photoelectron Spectroscopy of Cyclopropenylidene, Chlorocyclopropenylidene, and Their Deuterated Isotopomeres, J. Phys. Chem. A, 2010, 114, 42, 11269, https://doi.org/10.1021/jp104019d . [all data]