cyc-(DNOC)O

Vibrational and/or electronic energy levels

Data compiled by: Marilyn E. Jacox

State:   X

Vib.
sym.
 No.   Approximate
 type of mode
 cm-1   Med.   Method   References

C=O stretch 1936 T CO2 IR Milligan, Jacox, et al., 1962
1095 T CO2 IR Milligan, Jacox, et al., 1962
908 T CO2 IR Milligan, Jacox, et al., 1962
838 T CO2 IR Milligan, Jacox, et al., 1962

References

Milligan, Jacox, et al., 1962
Milligan, D.E.; Jacox, M.E.; Charles, S.W.; Pimentel, G.C., Infrared Spectroscopic Study of the Photolysis of HN3 in Solid CO2, J. Che. Phys., 1962, 37, 10, 2302, https://doi.org/10.1063/1.1733002 . [all data]