OIrO-

Vibrational and/or electronic energy levels

Data compiled by: Marilyn E. Jacox

State:   X

Vib.
sym.
 No.   Approximate
 type of mode
 cm-1   Med.   Method   References

Σu+ 3 Asym. stretch 915.7 Ar IR Gong and Zhou, 2009

References

Gong and Zhou, 2009
Gong, Y.; Zhou, M., Infrared Spectra of Transition-Metal Dioxide Anions: MO, J. Phys. Chem. A, 2009, 113, 17, 4990, https://doi.org/10.1021/jp900974w . [all data]