GeNNO

Vibrational and/or electronic energy levels

Data compiled by: Marilyn E. Jacox

State:   X

Vib.
sym.
 No.   Approximate
 type of mode
 cm-1   Med.   Method   References

a' 1 NO stretch 1443.7 Ar IR Jiang, Glatthaar, et al., 2009
2 Mixed 1102.4 Ar IR Jiang, Glatthaar, et al., 2009
3 Mixed 784.0 Ar IR Jiang, Glatthaar, et al., 2009

References

Jiang, Glatthaar, et al., 2009
Jiang, Z.-M.; Glatthaar, J.; Lee, Y.-P., Infrared absorption of GeNNO isolated in solid Ar, J. Chem. Phys., 2009, 131, 14, 144504, https://doi.org/10.1063/1.3236384 . [all data]