CC(H)CN

Vibrational and/or electronic energy levels

Data compiled by: Marilyn E. Jacox

State:   X

Vib.
sym.
 No.   Approximate
 type of mode
 cm-1   Med.   Method   References

a' CCH bend 924 T gas PE Goebbert, Khuseynov, et al., 2010

References

Goebbert, Khuseynov, et al., 2010
Goebbert, D.J.; Khuseynov, D.; Sanov, A., Photoelectron Imiaging Spectrum of Cyanovinylidene and Cyanoacetylene anion, J. Phys. Chem. A, 2010, 114, 6, 2259, https://doi.org/10.1021/jp9106102 . [all data]