C5D-

Vibrational and/or electronic energy levels

Data compiled by: Marilyn E. Jacox

State:   ?

 Energy
 (cm-1
 Med.   Transition   λmin
 (nm)
 λmax
 (nm)

References

Td = 19420 ± 40 gas Tulej, Pino, et al., 2010

State:   A

 Energy
 (cm-1
 Med.   Transition   λmin
 (nm)
 λmax
 (nm)

To = 19178.7 gas A-X 472 522 Tulej, Pino, et al., 2010
Tulej, Mazzotti, et al., 2011

Vib.
sym.
 No.   Approximate
 type of mode
 cm-1   Med.   Method   References

a Skel. a-stretch 1871 ± 12 gas PD Tulej, Pino, et al., 2010
Tulej, Mazzotti, et al., 2011
CCD deform. 282 ± 12 gas PD Tulej, Pino, et al., 2010
Tulej, Mazzotti, et al., 2011
Skel. bend 122 ± 8 gas PD Tulej, Pino, et al., 2010
Tulej, Mazzotti, et al., 2011

Tulej, Pino, et al., 2010
Tulej, M.; Pino, T.; Pachkov, M.; Maier, J.P., Electronic transitions of the C, Mol. Phys., 2010, 108, 7-9, 8865, https://doi.org/10.1080/00268970903501691 . [all data]

Tulej, Mazzotti, et al., 2011
Tulej, M.; Mazzotti, F.J.; Maier, J.P., Two-Color Photodetachment Study of the A, J. Phys. Chem. A, 2011, 115, 25, 6878, https://doi.org/10.1021/jp111722g . [all data]