(cyc-C5H5)=CH2+

Vibrational and/or electronic energy levels

Data compiled by: Marilyn E. Jacox

State:   A

 Energy
 (cm-1
 Med.   Transition   λmin
 (nm)
 λmax
 (nm)

References

To = 29822 Ne Garkusha, Fulara, et al., 2010

Garkusha, Fulara, et al., 2010
Garkusha, I.; Fulara, J.; Nagy, A.; Maier, J.P., Electronic Transitions of Protonated Benzene and Fulvene, and of C, J. Am. Chem. Soc., 2010, 132, 42, 14979, https://doi.org/10.1021/ja106470x . [all data]