(cyc-C5H5)=CH2

Vibrational and/or electronic energy levels

Data compiled by: Marilyn E. Jacox

State:   B

 Energy
 (cm-1
 Med.   Transition   λmin
 (nm)
 λmax
 (nm)

References

To = 30661 Ne B-X 312 326 Garkusha, Fulara, et al., 2010

Vib.
sym.
 No.   Approximate
 type of mode
 cm-1   Med.   Method   References

11 1356 Ne AB Garkusha, Fulara, et al., 2010
13 1225 Ne AB Garkusha, Fulara, et al., 2010
17 923 Ne AB Garkusha, Fulara, et al., 2010
21 622 T Ne AB Garkusha, Fulara, et al., 2010

State:   A

 Energy
 (cm-1
 Med.   Transition   λmin
 (nm)
 λmax
 (nm)

To = 18782 Ne A-X 511 532 Garkusha, Fulara, et al., 2010

Vib.
sym.
 No.   Approximate
 type of mode
 cm-1   Med.   Method   References

20 778 Ne AB Garkusha, Fulara, et al., 2010

Garkusha, Fulara, et al., 2010
Garkusha, I.; Fulara, J.; Nagy, A.; Maier, J.P., Electronic Transitions of Protonated Benzene and Fulvene, and of C, J. Am. Chem. Soc., 2010, 132, 42, 14979, https://doi.org/10.1021/ja106470x . [all data]