t-,c-DOCOD

Vibrational and/or electronic energy levels

Data compiled by: Marilyn E. Jacox

State:   X

Vib.
sym.
 No.   Approximate
 type of mode
 cm-1   Med.   Method   References

a' 1 OD stretch 2673.1 w Ar IR Schreiner and Reisenauer, 2008
3 Mixed 1300.3 w Ar IR Schreiner and Reisenauer, 2008
4 Mixed 1209.8 m Ar IR Schreiner and Reisenauer, 2008
6 Mixed 873.9 w Ar IR Schreiner and Reisenauer, 2008
a 9 OD wag 467.8 w Ar IR Schreiner and Reisenauer, 2008

References

Schreiner and Reisenauer, 2008
Schreiner, P.R.; Reisenauer, H.P., Spectroscopic Identification of Dihydroxycarbene, Angew. Chem. Int. Ed., 2008, 47, 37, 7071, https://doi.org/10.1002/anie.200802105 . [all data]