cum-C11H-

Vibrational and/or electronic energy levels

Data compiled by: Marilyn E. Jacox

State:   1A'

 Energy
 (cm-1
 Med.   Transition   λmin
 (nm)
 λmax
 (nm)

References

To = 26742 ± 10 gas Tulej, Guthe, et al., 1999

Additional references: Jacox, 2003, page 379

Tulej, Guthe, et al., 1999
Tulej, M.; Guthe, F.; Schnaiter, M.; Packhov, M.V.; Kirkwood, D.A.; Maier, J.P.; Fischer, G., Electronic Spectra of the Carbon Chain Anions C, J. Phys. Chem. A, 1999, 103, 48, 9712, https://doi.org/10.1021/jp992927v . [all data]

Jacox, 2003
Jacox, M.E., Vibrational and electronic energy levels of polyatomic transient molecules: supplement B, J. Phys. Chem. Ref. Data, 2003, 32, 1, 1-441, https://doi.org/10.1063/1.1497629 . [all data]