MgC6H

Vibrational and/or electronic energy levels

Data compiled by: Marilyn E. Jacox

State:   A

 Energy
 (cm-1
 Med.   Transition   λmin
 (nm)
 λmax
 (nm)

References

To = 22090.08 ± 0.07 gas A-X 437 453 Ding, Apetrei, et al., 2008
Chasovskikh, Jochnowitz, et al., 2008

Vib.
sym.
 No.   Approximate
 type of mode
 cm-1   Med.   Method   References

Σ+ MgC stretch 383 gas MPI Ding, Apetrei, et al., 2008

Ding, Apetrei, et al., 2008
Ding, H.; Apetrei, C.; Chacaga, L.; Maier, J.P., Electronic Spectra of MgC, Astrophys. J., 2008, 677, 1, 348, https://doi.org/10.1086/524375 . [all data]

Chasovskikh, Jochnowitz, et al., 2008
Chasovskikh, E.; Jochnowitz, E.B.; Maier, J.P., Electronic Spectra of the MgC, J. Phys. Chem. A, 2008, 112, 37, 8686, https://doi.org/10.1021/jp803969a . [all data]